pastebin - collaborative debugging tool
eckelmann.kpaste.net RSS


Build failure in ecu01-comp-cap/mmc_imp.o
Posted by Anonymous on Fri 23rd Aug 2019 15:31
raw | new post

  1. target: ecu01-comp-cap.compile
  2. ------------------------------
  3.  
  4. PATH=/var/lib/jenkins/workspace/rauch_jncg_release_QA_V3.1.9/ptxdist/platform-ecu01/sysroot-cross/bin:/var/lib/jenkins/workspace/rauch_jncg_release_QA_V3.1.9/ptxdist/platform-ecu01/sysroot-cross/sbin:$PATH KCONFIG_NOTIMESTAMP=1 HOST_EXTRACFLAGS="-isystem /var/lib/jenkins/workspace/rauch_jncg_release_QA_V3.1.9/ptxdist/platform-ecu01/sysroot-host/include" make -j24 V=0 HOSTCC=gcc ARCH=arm CROSS_COMPILE=arm-v5te-linux-gnueabi- INSTALL_MOD_PATH=/var/lib/jenkins/workspace/rauch_jncg_release_QA_V3.1.9/ptxdist/platform-ecu01/packages/linux-3.10.108 PTX_KERNEL_DIR=/var/lib/jenkins/workspace/rauch_jncg_release_QA_V3.1.9/ptxdist/platform-ecu01/build-target/linux-3.10.108 CONFIG_DEBUG_SECTION_MISMATCH=y DEPMOD=/var/lib/jenkins/workspace/rauch_jncg_release_QA_V3.1.9/ptxdist/platform-ecu01/sysroot-cross/sbin/arm-v5te-linux-gnueabi-depmod \
  5.         -C /var/lib/jenkins/workspace/rauch_jncg_release_QA_V3.1.9/ptxdist/platform-ecu01/build-target/linux-3.10.108 \
  6.         M=/var/lib/jenkins/workspace/rauch_jncg_release_QA_V3.1.9/ptxdist/platform-ecu01/build-target/ecu01-comp-cap \
  7.         modules
  8. make[1]: Entering directory '/var/lib/jenkins/workspace/rauch_jncg_release_QA_V3.1.9/ptxdist/platform-ecu01/build-target/linux-3.10.108'
  9.   CC [M]  /var/lib/jenkins/workspace/rauch_jncg_release_QA_V3.1.9/ptxdist/platform-ecu01/build-target/ecu01-comp-cap/main.o
  10.   CC [M]  /var/lib/jenkins/workspace/rauch_jncg_release_QA_V3.1.9/ptxdist/platform-ecu01/build-target/ecu01-comp-cap/comp_cap.o
  11.   CC [M]  /var/lib/jenkins/workspace/rauch_jncg_release_QA_V3.1.9/ptxdist/platform-ecu01/build-target/ecu01-comp-cap/mmc.o
  12.   CC [M]  /var/lib/jenkins/workspace/rauch_jncg_release_QA_V3.1.9/ptxdist/platform-ecu01/build-target/ecu01-comp-cap/mmc_imp.o
  13. /var/lib/jenkins/workspace/rauch_jncg_release_QA_V3.1.9/ptxdist/platform-ecu01/build-target/ecu01-comp-cap/comp_cap.c: In function 'cc_isr':
  14. /var/lib/jenkins/workspace/rauch_jncg_release_QA_V3.1.9/ptxdist/platform-ecu01/build-target/ecu01-comp-cap/comp_cap.c:43:4: warning: ISO C90 forbids mixed declarations and code [-Wdeclaration-after-statement]
  15. /var/lib/jenkins/workspace/rauch_jncg_release_QA_V3.1.9/ptxdist/platform-ecu01/build-target/ecu01-comp-cap/main.c:559:1: warning: initialization from incompatible pointer type [enabled by default]
  16. /var/lib/jenkins/workspace/rauch_jncg_release_QA_V3.1.9/ptxdist/platform-ecu01/build-target/ecu01-comp-cap/main.c:559:1: warning: (near initialization for 'comp_cap_fops.read') [enabled by default]
  17. /var/lib/jenkins/workspace/rauch_jncg_release_QA_V3.1.9/ptxdist/platform-ecu01/build-target/ecu01-comp-cap/mmc_imp.c: In function 'qa_mmc_calc':
  18. /var/lib/jenkins/workspace/rauch_jncg_release_QA_V3.1.9/ptxdist/platform-ecu01/build-target/ecu01-comp-cap/mmc_imp.c:283:4: error: implicit declaration of function 'get_value' [-Werror=implicit-function-declaration]
  19. /var/lib/jenkins/workspace/rauch_jncg_release_QA_V3.1.9/ptxdist/platform-ecu01/build-target/ecu01-comp-cap/mmc_imp.c:113:10: warning: unused variable 'j' [-Wunused-variable]
  20. cc1: some warnings being treated as errors
  21. scripts/Makefile.build:308: recipe for target '/var/lib/jenkins/workspace/rauch_jncg_release_QA_V3.1.9/ptxdist/platform-ecu01/build-target/ecu01-comp-cap/mmc_imp.o' failed
  22. make[2]: *** [/var/lib/jenkins/workspace/rauch_jncg_release_QA_V3.1.9/ptxdist/platform-ecu01/build-target/ecu01-comp-cap/mmc_imp.o] Error 1
  23. make[2]: *** Waiting for unfinished jobs....
  24. Makefile:1228: recipe for target '_module_/var/lib/jenkins/workspace/rauch_jncg_release_QA_V3.1.9/ptxdist/platform-ecu01/build-target/ecu01-comp-cap' failed
  25. make[1]: Leaving directory '/var/lib/jenkins/workspace/rauch_jncg_release_QA_V3.1.9/ptxdist/platform-ecu01/build-target/linux-3.10.108'
  26. make[1]: *** [_module_/var/lib/jenkins/workspace/rauch_jncg_release_QA_V3.1.9/ptxdist/platform-ecu01/build-target/ecu01-comp-cap] Error 2
  27. make: *** [/var/lib/jenkins/workspace/rauch_jncg_release_QA_V3.1.9/ptxdist/platform-ecu01/state/ecu01-comp-cap.compile] Error 2
  28. /var/lib/jenkins/workspace/rauch_jncg_release_QA_V3.1.9/ptxdist/rules/ecu01-comp-cap.make:52: recipe for target '/var/lib/jenkins/workspace/rauch_jncg_release_QA_V3.1.9/ptxdist/platform-ecu01/state/ecu01-comp-cap.compile' failed
  29. [Pipeline] }
  30. [Pipeline] // gitlabCommitStatus
  31. [Pipeline] }
  32. [Pipeline] // stage
  33. [Pipeline] }
  34. $ docker stop --time=1 0315204cb20dcc35d7e762cce7c6056633fe7157c19593bd9a4b3b78041c1fb2
  35. $ docker rm -f 0315204cb20dcc35d7e762cce7c6056633fe7157c19593bd9a4b3b78041c1fb2
  36. [Pipeline] // withDockerContainer
  37. [Pipeline] }
  38. [Pipeline] // node
  39. [Pipeline] End of Pipeline
  40. ERROR: script returned exit code 2
  41. Finished: FAILURE

Submit a correction or amendment below (click here to make a fresh posting)
After submitting an amendment, you'll be able to view the differences between the old and new posts easily.

Syntax highlighting:

To highlight particular lines, prefix each line with {%HIGHLIGHT}





All content is user-submitted.
The administrators of this site (kpaste.net) are not responsible for their content.
Abuse reports should be emailed to us at